Reaction Details
TargetMuscarinic acetylcholine receptor M1
LigandBDBM50008078
Substrate/Competitorn/a
Meas. Tech.ChEBML_138791
IC50 775±n/a nM
Citation Shapiro, GFloersheim, PBoelsterli, JAmstutz, RBolliger, GGammenthaler, HGmelin, GSupavilai, PWalkinshaw, M Muscarinic activity of the thiolactone, lactam, lactol, and thiolactol analogues of pilocarpine and a hypothetical model for the binding of agonists to the m1 receptor. J Med Chem35:15-27 (1992) Muscarinic acetylcholine receptor M1
Name:Muscarinic acetylcholine receptor M1
Type:Enzyme Catalytic Domain
Mol. Mass.:51390.46
Organism:RAT
Description:P08482
Residue:460
BDBM50008078
NameBDBM50008078
Synonyms:3-Ethyl-4-(3-methyl-3H-imidazol-4-ylmethyl)-dihydro-thiophen-2-one | CHEMBL315191
TypeSmall organic molecule
Emp. Form.C11H16N2OS
Mol. Mass.224.323
SMILESCC[C@@H]1[C@@H](Cc2cncn2C)CSC1=O