Reaction Details
Target5-hydroxytryptamine receptor 1A
LigandBDBM50008224
Substrate/Competitorn/a
Meas. Tech.ChEBML_225150
Ki 2±n/a nM
Citation Oberlender, RPfaff, RCJohnson, MPHuang, XMNichols, DE Stereoselective LSD-like activity in d-lysergic acid amides of (R)- and (S)-2-aminobutane. J Med Chem35:203-11 (1992) 5-hydroxytryptamine receptor 1A
Name:5-hydroxytryptamine receptor 1A
Type:G Protein-Coupled Receptor (GPCR)
Mol. Mass.:46445.29
Organism:Rattus norvegicus (rat)
Description:Binding assays were performed using rat hippocampal membranes.
Residue:422
BDBM50008224
NameBDBM50008224
Synonyms:(6aR,9R)-7-Methyl-4,6,6a,7,8,9-hexahydro-indolo[4,3-fg]quinoline-9-carboxylic acid ((R)-sec-butyl)-amide CHEMBL66335
TypeSmall organic molecule
Emp. Form.C20H25N3O
Mol. Mass.323.432
SMILESCC[C@@H](C)NC(=O)[C@H]1CN(C)[C@@H]2Cc3c[nH]c4cccc(C2=C1)c34