Reaction Details
TargetC5a anaphylatoxin chemotactic receptor 1
LigandBDBM50229889
Substrate/Competitorn/a
Meas. Tech.ChEBML_41471
Ki 1600±n/a nM
Citation Kawai, MQuincy, DALane, BMollison, KWOr, YSLuly, JRCarter, GW Structure-function studies in a series of carboxyl-terminal octapeptide analogues of anaphylatoxin C5a. J Med Chem35:220-3 (1992) C5a anaphylatoxin chemotactic receptor 1
Name:C5a anaphylatoxin chemotactic receptor 1
Type:Enzyme
Mol. Mass.:39347.68
Organism:Homo sapiens (Human)
Description:P21730
Residue:350
BDBM50229889
NameBDBM50229889
Synonyms:CHEMBL3350366
TypeSmall organic molecule
Emp. Form.C50H84N14O12
Mol. Mass.1073.2886
SMILESCC(C)[C@H](NC(=O)[C@H](CC1CCCCC1)NC(=O)[C@H](CC1CCCCC1)NC(=O)[C@H](CC(O)=O)NC(=O)[C@H](CCCCN)NC(=O)[C@H](Cc1c[nH]cn1)NC(C)=O)C(=O)N[C@H](C)C(=O)N[C@@H](CCCN=C(N)N)C(O)=O