Reaction Details
TargetC5a anaphylatoxin chemotactic receptor 1
LigandBDBM50008235
Substrate/Competitorn/a
Meas. Tech.ChEBML_41471
Ki 150000±n/a nM
Citation Kawai, MQuincy, DALane, BMollison, KWOr, YSLuly, JRCarter, GW Structure-function studies in a series of carboxyl-terminal octapeptide analogues of anaphylatoxin C5a. J Med Chem35:220-3 (1992) C5a anaphylatoxin chemotactic receptor 1
Name:C5a anaphylatoxin chemotactic receptor 1
Type:Enzyme
Mol. Mass.:39347.68
Organism:Homo sapiens (Human)
Description:P21730
Residue:350
BDBM50008235
NameBDBM50008235
Synonyms:2-[2-(2-{2-[2-(2-{2-[2-Acetylamino-3-(3H-imidazol-4-yl)-propionylamino]-6-amino-hexanoylamino}-3-carboxy-propionylamino)-4-methylsulfanyl-butyrylamino]-4-carbamoyl-butyrylamino}-4-methyl-pentanoylamino)-acetylamino]-5-guanidino-pentanoic acid | CHEMBL2369501
TypeSmall organic molecule
Emp. Form.C42H71N15O13S
Mol. Mass.1026.171
SMILESCSCC[C@@H](NC(=O)[C@H](CC(O)=O)NC(=O)[C@H](CCCCN)NC(=O)[C@H](Cc1c[nH]cn1)NC(C)=O)C(=O)N[C@@H](CCC(N)=O)C(=O)N[C@@H](CC(C)C)C(=O)NCC(=O)N[C@@H](CCCN=C(N)N)C(O)=O