Reaction Details
TargetC5a anaphylatoxin chemotactic receptor 1
LigandBDBM50008379
Substrate/Competitorn/a
Meas. Tech.ChEBML_41602
Ki 13000±n/a nM
Citation Or, YSClark, RFLane, BMollison, KWCarter, GWLuly, JR Improvements in the minimum binding sequence of C5a: examination of His-67. J Med Chem35:402-6 (1992) C5a anaphylatoxin chemotactic receptor 1
Name:C5a anaphylatoxin chemotactic receptor 1
Type:Enzyme
Mol. Mass.:39347.68
Organism:Homo sapiens (Human)
Description:P21730
Residue:350
BDBM50008379
NameBDBM50008379
Synonyms:CHEMBL339127 | H-Cha-Lys-AspMet-GIn-Leu-Gly-Arg-OH
TypeSmall organic molecule
Emp. Form.C43H77N13O12S
Mol. Mass.1000.216
SMILESCSCC[C@H](NC(=O)[C@H](CC(O)=O)NC(=O)[C@H](CCCCN)NC(=O)[C@H](N)CC1CCCCC1)C(=O)N[C@@H](CCC(N)=O)C(=O)N[C@@H](CC(C)C)C(=O)NCC(=O)N[C@@H](CCCNC(N)=N)C(O)=O