Reaction Details
TargetAminopeptidase B
LigandBDBM50008427
Substrate/Competitorn/a
Meas. Tech.ChEBML_36049
Ki 130000±n/a nM
Citation Ocain, TDRich, DH alpha-Keto amide inhibitors of aminopeptidases. J Med Chem35:451-6 (1992) Aminopeptidase B
Name:Aminopeptidase B
Type:PROTEIN
Mol. Mass.:72586.33
Organism:Homo sapiens (Human)
Description:ChEMBL_36048
Residue:650
BDBM50008427
NameBDBM50008427
Synonyms:5-Amino-2,7-dimethyl-4-oxo-octanoic acid | CHEMBL341941
TypeSmall organic molecule
Emp. Form.C10H19NO3
Mol. Mass.201.2628
SMILESCC(C)C[C@H](N)C(=O)CC(C)C(O)=O