Reaction Details
TargetAminopeptidase B
LigandBDBM50008430
Substrate/Competitorn/a
Meas. Tech.ChEBML_36049
Ki 1500±n/a nM
Citation Ocain, TDRich, DH alpha-Keto amide inhibitors of aminopeptidases. J Med Chem35:451-6 (1992) Aminopeptidase B
Name:Aminopeptidase B
Type:PROTEIN
Mol. Mass.:72586.33
Organism:Homo sapiens (Human)
Description:ChEMBL_36048
Residue:650
BDBM50008430
NameBDBM50008430
Synonyms:3-Amino-N-(3-methyl-butyl)-2-oxo-4-phenyl-butyramide | CHEMBL143589
TypeSmall organic molecule
Emp. Form.C15H22N2O2
Mol. Mass.262.3474
SMILESCC(C)CCNC(=O)C(=O)C(N)Cc1ccccc1