Reaction Details
TargetAminopeptidase B
LigandBDBM50008431
Substrate/Competitorn/a
Meas. Tech.ChEBML_36049
Ki 39000±n/a nM
Citation Ocain, TDRich, DH alpha-Keto amide inhibitors of aminopeptidases. J Med Chem35:451-6 (1992) Aminopeptidase B
Name:Aminopeptidase B
Type:PROTEIN
Mol. Mass.:72586.33
Organism:Homo sapiens (Human)
Description:ChEMBL_36048
Residue:650
BDBM50008431
NameBDBM50008431
Synonyms:3-Amino-2-hydroxy-N-(3-methyl-butyl)-4-phenyl-butyramide | CHEMBL309130
TypeSmall organic molecule
Emp. Form.C15H24N2O2
Mol. Mass.264.3633
SMILESCC(C)CCNC(=O)[C@@H](O)[C@H](N)Cc1ccccc1