Reaction Details
Target5-hydroxytryptamine receptor 7
LigandBDBM50258454
Substrate/Competitorn/a
Meas. Tech.ChEBML_1690520
Ki 2.0±n/a nM
Citation Bucki, AMarcinkowska, M?niecikowska, JWi?ckowski, KPaw?owski, MG?uch-Lutwin, MGrybo?, ASiwek, APytka, KJastrz?bska-Wi?sek, MPartyka, AWeso?owska, AMierzejewski, PKo?aczkowski, M Novel 3-(1,2,3,6-Tetrahydropyridin-4-yl)-1H-indole-Based Multifunctional Ligands with Antipsychotic-Like, Mood-Modulating, and Procognitive Activity. J Med Chem60:7483-7501 (2017) 
 
5-hydroxytryptamine receptor 7
Name:5-hydroxytryptamine receptor 7
Type:G Protein-Coupled Receptor (GPCR)
Mol. Mass.:53573.08
Organism:Homo sapiens (Human)
Description:P34969
Residue:479
BDBM50258454
NameBDBM50258454
Synonyms:CHEMBL4095555
TypeSmall organic molecule
Emp. Form.C21H21ClFN3O2S
Mol. Mass.433.927
SMILESFc1cccc(c1)S(=O)(=O)NCCN1CCC(=CC1)c1c[nH]c2ccc(Cl)cc12