Reaction Details
TargetCannabinoid receptor 1
LigandBDBM50258769
Substrate/Competitorn/a
Meas. Tech.ChEMBL_1690664 (CHEMBL4041234)
IC50 18±n/a nM
Citation Nguyen, TGerman, NDecker, AMLangston, TLGamage, TFFarquhar, CELi, JXWiley, JLThomas, BFZhang, Y Novel Diarylurea Based Allosteric Modulators of the Cannabinoid CB1 Receptor: Evaluation of Importance of 6-Pyrrolidinylpyridinyl Substitution. J Med Chem60:7410-7424 (2017) 
 
Cannabinoid receptor 1
Name:Cannabinoid receptor 1
Type:G Protein-Coupled Receptor (GPCR)
Mol. Mass.:52868.96
Organism:Homo sapiens (Human)
Description:P21554
Residue:472
BDBM50258769
NameBDBM50258769
Synonyms:CHEMBL4096928
TypeSmall organic molecule
Emp. Form.C19H13ClF2N2O
Mol. Mass.358.769
SMILESFc1ccc(c(F)c1)-c1cccc(NC(=O)Nc2ccc(Cl)cc2)c1