Reaction Details
TargetMelanocortin receptor 4
LigandBDBM50258943
Substrate/Competitorn/a
Meas. Tech.ChEMBL_1690819 (CHEMBL4041389)
Ki 54±n/a nM
Citation Ericson, MDFreeman, KTSchnell, SMFleming, KAHaskell-Luevano, C Structure-Activity Relationship Studies on a Macrocyclic Agouti-Related Protein (AGRP) Scaffold Reveal Agouti Signaling Protein (ASP) Residue Substitutions Maintain Melanocortin-4 Receptor Antagonist Potency and Result in Inverse Agonist Pharmacology at the Melanocortin-5 Receptor. J Med Chem60:8103-8114 (2017) 
 
Melanocortin receptor 4
Name:Melanocortin receptor 4
Type:PROTEIN
Mol. Mass.:36964.43
Organism:Mus musculus
Description:ChEMBL_1498850
Residue:332
BDBM50258943
NameBDBM50258943
Synonyms:CHEMBL4060087
TypeSmall organic molecule
Emp. Form.C38H53N11O9S2
Mol. Mass.872.026
SMILESC[C@@H]1NC(=O)[C@H](CO)NC(=O)CNC(=O)[C@H](Cc2ccccc2)NC(=O)[C@H](Cc2ccccc2)NC(=O)[C@H](CCCNC(N)=N)NC(=O)[C@H](CS)NC(=O)[C@H](CS)NC1=O