Reaction Details
TargetD(2) dopamine receptor
LigandBDBM50005118
Substrate/Competitorn/a
Meas. Tech.ChEMBL_62415 (CHEMBL675740)
Ki 33±n/a nM
Citation Bishop, JEMathis, CAGerdes, JMWhitney, JMEaton, AMMailman, RB Synthesis and in vitro evaluation of 2,3-dimethoxy-5-(fluoroalkyl)-substituted benzamides: high-affinity ligands for CNS dopamine D2 receptors. J Med Chem34:1612-24 (1991) D(2) dopamine receptor
Name:D(2) dopamine receptor
Type:G Protein-Coupled Receptor (GPCR)
Mol. Mass.:50931.60
Organism:Rattus norvegicus (rat)
Description:P61169
Residue:444
BDBM50005118
NameBDBM50005118
Synonyms:(S)-3,5-Dichloro-N-(1-ethyl-pyrrolidin-2-ylmethyl)-2-hydroxy-6-methoxy-benzamide (S)3,5-Dichloro-N-(1-ethyl-pyrrolidin-2-ylmethyl)-2-hydroxy-6-methoxy-benzamide 3,5-Dichloro-N-(1-ethyl-pyrrolidin-2-ylmethyl)-2-hydroxy-6-methoxy-benzamide 3,5-Dichloro-N-(1-ethyl-pyrrolidin-2-ylmethyl)-2-hydroxy-6-methoxy-benzamide(Raclopride) RACLOPRIDE | Raclopride;3,5-Dichloro-N-(1-ethyl-pyrrolidin-2-ylmethyl)-2-hydroxy-6-methoxy-benzamide
TypeSmall organic molecule
Emp. Form.C15H20Cl2N2O3
Mol. Mass.347.237
SMILESCCN1CCC[C@H]1CNC(=O)c1c(O)c(Cl)cc(Cl)c1OC