Reaction Details
TargetD(2) dopamine receptor
LigandBDBM50008783
Substrate/Competitorn/a
Meas. Tech.ChEBML_62416
Ki 0.250000±n/a nM
Citation Bishop, JEMathis, CAGerdes, JMWhitney, JMEaton, AMMailman, RB Synthesis and in vitro evaluation of 2,3-dimethoxy-5-(fluoroalkyl)-substituted benzamides: high-affinity ligands for CNS dopamine D2 receptors. J Med Chem34:1612-24 (1991) D(2) dopamine receptor
Name:D(2) dopamine receptor
Type:G Protein-Coupled Receptor (GPCR)
Mol. Mass.:50931.60
Organism:Rattus norvegicus (rat)
Description:P61169
Residue:444
BDBM50008783
NameBDBM50008783
Synonyms:CHEMBL42448 | N-(1-Ethyl-pyrrolidin-2-ylmethyl)-3-(3-fluoro-propyl)-2-hydroxy-5,6-dimethoxy-benzamide
TypeSmall organic molecule
Emp. Form.C19H29FN2O4
Mol. Mass.368.443
SMILESCCN1CCC[C@H]1CNC(=O)c1c(O)c(CCCF)cc(OC)c1OC