Reaction Details
TargetD(2) dopamine receptor
LigandBDBM50008784
Substrate/Competitorn/a
Meas. Tech.ChEMBL_62415 (CHEMBL675740)
Ki 5.3±n/a nM
Citation Bishop, JEMathis, CAGerdes, JMWhitney, JMEaton, AMMailman, RB Synthesis and in vitro evaluation of 2,3-dimethoxy-5-(fluoroalkyl)-substituted benzamides: high-affinity ligands for CNS dopamine D2 receptors. J Med Chem34:1612-24 (1991) D(2) dopamine receptor
Name:D(2) dopamine receptor
Type:G Protein-Coupled Receptor (GPCR)
Mol. Mass.:50931.60
Organism:Rattus norvegicus (rat)
Description:P61169
Residue:444
BDBM50008784
NameBDBM50008784
Synonyms:CHEMBL288704 | N-(1-Ethyl-pyrrolidin-2-ylmethyl)-5-(2-fluoro-ethyl)-2,3-dimethoxy-benzamide
TypeSmall organic molecule
Emp. Form.C18H27FN2O3
Mol. Mass.338.417
SMILESCCN1CCC[C@H]1CNC(=O)c1cc(CCF)cc(OC)c1OC