Reaction Details
TargetCarbonic anhydrase 2
LigandBDBM50258997
Substrate/Competitorn/a
Meas. Tech.ChEBML_1690988
IC50 0.651000±n/a nM
Citation Alt?ntop, MDSever, BAkal?nÇiftçi, GKucukoglu, KÖzdemir, ASoleimani, SSNadaroglu, HKaplanc?kl?, ZA Synthesis and evaluation of new benzodioxole-based dithiocarbamate derivatives as potential anticancer agents and hCA-I and hCA-II inhibitors. Eur J Med Chem125:190-196 (2017) 
 
Carbonic anhydrase 2
Name:Carbonic anhydrase 2
Type:Enzyme
Mol. Mass.:29250.71
Organism:Homo sapiens (Human)
Description:P00918
Residue:260
BDBM50258997
NameBDBM50258997
Synonyms:CHEMBL4089189
TypeSmall organic molecule
Emp. Form.C16H21N3O3S2
Mol. Mass.367.486
SMILESO=C(CSC(=S)NN1CCCCC1)NCc1ccc2OCOc2c1