Reaction Details
Target5-hydroxytryptamine receptor 1A
LigandBDBM50004770
Substrate/Competitorn/a
Meas. Tech.ChEBML_1691076
Ki 0.660693±n/a nM
Citation Del Bello, FBonifazi, AGiannella, MGiorgioni, GPiergentili, APetrelli, RCifani, CMicioni Di Bonaventura, MVKeck, TMMazzolari, AVistoli, GCilia, APoggesi, EMatucci, RQuaglia, W The replacement of the 2-methoxy substituent of N-((6,6-diphenyl-1,4-dioxan-2-yl)methyl)-2-(2-methoxyphenoxy)ethan-1-amine improves the selectivity for 5-HT Eur J Med Chem125:233-244 (2017) 
 
5-hydroxytryptamine receptor 1A
Name:5-hydroxytryptamine receptor 1A
Type:n/a
Mol. Mass.:46122.49
Organism:Homo sapiens (Human)
Description:n/a
Residue:422
BDBM50004770
NameBDBM50004770
Synonyms:CHEMBL2312227
TypeSmall organic molecule
Emp. Form.C26H29NO4
Mol. Mass.419.5128
SMILESCOc1ccccc1OCCNCC1COCC(O1)(c1ccccc1)c1ccccc1