Reaction Details
TargetD(3) dopamine receptor
LigandBDBM50259024
Substrate/Competitorn/a
Meas. Tech.ChEBML_1691083
Ki 66±n/a nM
Citation Del Bello, FBonifazi, AGiannella, MGiorgioni, GPiergentili, APetrelli, RCifani, CMicioni Di Bonaventura, MVKeck, TMMazzolari, AVistoli, GCilia, APoggesi, EMatucci, RQuaglia, W The replacement of the 2-methoxy substituent of N-((6,6-diphenyl-1,4-dioxan-2-yl)methyl)-2-(2-methoxyphenoxy)ethan-1-amine improves the selectivity for 5-HT Eur J Med Chem125:233-244 (2017) 
 
D(3) dopamine receptor
Name:D(3) dopamine receptor
Type:n/a
Mol. Mass.:44243.43
Organism:Homo sapiens (Human)
Description:n/a
Residue:400
BDBM50259024
NameBDBM50259024
Synonyms:CHEMBL4071929
TypeSmall organic molecule
Emp. Form.C27H31NO5
Mol. Mass.449.5387
SMILESCOCOc1ccccc1OCCNCC1COCC(O1)(c1ccccc1)c1ccccc1