Reaction Details
TargetD(4) dopamine receptor
LigandBDBM50259024
Substrate/Competitorn/a
Meas. Tech.ChEMBL_1691084 (CHEMBL4041733)
Ki 51±n/a nM
Citation Del Bello, FBonifazi, AGiannella, MGiorgioni, GPiergentili, APetrelli, RCifani, CMicioni Di Bonaventura, MVKeck, TMMazzolari, AVistoli, GCilia, APoggesi, EMatucci, RQuaglia, W The replacement of the 2-methoxy substituent of N-((6,6-diphenyl-1,4-dioxan-2-yl)methyl)-2-(2-methoxyphenoxy)ethan-1-amine improves the selectivity for 5-HT Eur J Med Chem125:233-244 (2017) 
 
D(4) dopamine receptor
Name:D(4) dopamine receptor
Type:Enzyme
Mol. Mass.:48373.19
Organism:Homo sapiens (Human)
Description:P21917
Residue:419
BDBM50259024
NameBDBM50259024
Synonyms:CHEMBL4071929
TypeSmall organic molecule
Emp. Form.C27H31NO5
Mol. Mass.449.5387
SMILESCOCOc1ccccc1OCCNCC1COCC(O1)(c1ccccc1)c1ccccc1