Reaction Details
TargetAlpha-1D adrenergic receptor
LigandBDBM50259024
Substrate/Competitorn/a
Meas. Tech.ChEBML_1691075
Ki 79±n/a nM
Citation Del Bello, FBonifazi, AGiannella, MGiorgioni, GPiergentili, APetrelli, RCifani, CMicioni Di Bonaventura, MVKeck, TMMazzolari, AVistoli, GCilia, APoggesi, EMatucci, RQuaglia, W The replacement of the 2-methoxy substituent of N-((6,6-diphenyl-1,4-dioxan-2-yl)methyl)-2-(2-methoxyphenoxy)ethan-1-amine improves the selectivity for 5-HT Eur J Med Chem125:233-244 (2017) 
 
Alpha-1D adrenergic receptor
Name:Alpha-1D adrenergic receptor
Type:Enzyme Catalytic Domain
Mol. Mass.:60485.82
Organism:Homo sapiens (Human)
Description:adrenergic Alpha1D ADRA1D HUMAN::P25100
Residue:572
BDBM50259024
NameBDBM50259024
Synonyms:CHEMBL4071929
TypeSmall organic molecule
Emp. Form.C27H31NO5
Mol. Mass.449.5387
SMILESCOCOc1ccccc1OCCNCC1COCC(O1)(c1ccccc1)c1ccccc1