Reaction Details
TargetAlpha-1B adrenergic receptor
LigandBDBM50259020
Substrate/Competitorn/a
Meas. Tech.ChEBML_1691073
Ki 115±n/a nM
Citation Del Bello, FBonifazi, AGiannella, MGiorgioni, GPiergentili, APetrelli, RCifani, CMicioni Di Bonaventura, MVKeck, TMMazzolari, AVistoli, GCilia, APoggesi, EMatucci, RQuaglia, W The replacement of the 2-methoxy substituent of N-((6,6-diphenyl-1,4-dioxan-2-yl)methyl)-2-(2-methoxyphenoxy)ethan-1-amine improves the selectivity for 5-HT Eur J Med Chem125:233-244 (2017) 
 
Alpha-1B adrenergic receptor
Name:Alpha-1B adrenergic receptor
Type:Enzyme
Mol. Mass.:56862.13
Organism:Homo sapiens (Human)
Description:P35368
Residue:520
BDBM50259020
NameBDBM50259020
Synonyms:CHEMBL4091168
TypeSmall organic molecule
Emp. Form.C24H26N2O3
Mol. Mass.390.4748
SMILESC(COc1ccccn1)NCC1COCC(O1)(c1ccccc1)c1ccccc1