Reaction Details
TargetAlpha-1A adrenergic receptor
LigandBDBM50004770
Substrate/Competitorn/a
Meas. Tech.ChEBML_1691074
Ki 28±n/a nM
Citation Del Bello, FBonifazi, AGiannella, MGiorgioni, GPiergentili, APetrelli, RCifani, CMicioni Di Bonaventura, MVKeck, TMMazzolari, AVistoli, GCilia, APoggesi, EMatucci, RQuaglia, W The replacement of the 2-methoxy substituent of N-((6,6-diphenyl-1,4-dioxan-2-yl)methyl)-2-(2-methoxyphenoxy)ethan-1-amine improves the selectivity for 5-HT Eur J Med Chem125:233-244 (2017) 
 
Alpha-1A adrenergic receptor
Name:Alpha-1A adrenergic receptor
Type:Cell-surface receptors
Mol. Mass.:51511.67
Organism:Homo sapiens (Human)
Description:P35348
Residue:466
BDBM50004770
NameBDBM50004770
Synonyms:CHEMBL2312227
TypeSmall organic molecule
Emp. Form.C26H29NO4
Mol. Mass.419.5128
SMILESCOc1ccccc1OCCNCC1COCC(O1)(c1ccccc1)c1ccccc1