Reaction Details
Target5-hydroxytryptamine receptor 1A
LigandBDBM50004768
Substrate/Competitorn/a
Meas. Tech.ChEBML_1691076
Ki 0.398107±n/a nM
Citation Del Bello, FBonifazi, AGiannella, MGiorgioni, GPiergentili, APetrelli, RCifani, CMicioni Di Bonaventura, MVKeck, TMMazzolari, AVistoli, GCilia, APoggesi, EMatucci, RQuaglia, W The replacement of the 2-methoxy substituent of N-((6,6-diphenyl-1,4-dioxan-2-yl)methyl)-2-(2-methoxyphenoxy)ethan-1-amine improves the selectivity for 5-HT Eur J Med Chem125:233-244 (2017) 
 
5-hydroxytryptamine receptor 1A
Name:5-hydroxytryptamine receptor 1A
Type:n/a
Mol. Mass.:46122.49
Organism:Homo sapiens (Human)
Description:n/a
Residue:422
BDBM50004768
NameBDBM50004768
Synonyms:CHEMBL2312538
TypeSmall organic molecule
Emp. Form.C25H27NO3
Mol. Mass.389.4868
SMILESC(COc1ccccc1)NC[C@H]1COCC(O1)(c1ccccc1)c1ccccc1