Reaction Details
TargetDual specificity protein kinase CLK4
LigandBDBM50259477
Substrate/Competitorn/a
Meas. Tech.ChEBML_1691313
IC50 37±n/a nM
Citation Bendjeddou, LZLoaëc, NVilliers, BPrina, ESpäth, GFGalons, HMeijer, LOumata, N Exploration of the imidazo[1,2-b]pyridazine scaffold as a protein kinase inhibitor. Eur J Med Chem125:696-709 (2017) 
 
Dual specificity protein kinase CLK4
Name:Dual specificity protein kinase CLK4
Type:PROTEIN
Mol. Mass.:57374.39
Organism:Mus musculus
Description:ChEMBL_1502248
Residue:481
BDBM50259477
NameBDBM50259477
Synonyms:CHEMBL4071322
TypeSmall organic molecule
Emp. Form.C19H22N4O3
Mol. Mass.354.403
SMILESCCOC(=O)c1cccc(c1)-c1cnc2ccc(N[C@@H](CC)CO)nn12