Reaction Details
TargetDual specificity protein kinase CLK1
LigandBDBM50259467
Substrate/Competitorn/a
Meas. Tech.ChEBML_1691310
IC50 41±n/a nM
Citation Bendjeddou, LZLoaëc, NVilliers, BPrina, ESpäth, GFGalons, HMeijer, LOumata, N Exploration of the imidazo[1,2-b]pyridazine scaffold as a protein kinase inhibitor. Eur J Med Chem125:696-709 (2017) 
 
Dual specificity protein kinase CLK1
Name:Dual specificity protein kinase CLK1
Type:PROTEIN
Mol. Mass.:57124.52
Organism:Mus musculus
Description:ChEMBL_1502245
Residue:483
BDBM50259467
NameBDBM50259467
Synonyms:CHEMBL4070189
TypeSmall organic molecule
Emp. Form.C17H20N4O3S
Mol. Mass.360.431
SMILESCC[C@@H](CO)Nc1ccc2ncc(-c3cccc(c3)S(C)(=O)=O)n2n1