Reaction Details
TargetDual specificity protein kinase CLK3
LigandBDBM50259477
Substrate/Competitorn/a
Meas. Tech.ChEBML_1691312
IC50 820±n/a nM
Citation Bendjeddou, LZLoaëc, NVilliers, BPrina, ESpäth, GFGalons, HMeijer, LOumata, N Exploration of the imidazo[1,2-b]pyridazine scaffold as a protein kinase inhibitor. Eur J Med Chem125:696-709 (2017) 
 
Dual specificity protein kinase CLK3
Name:Dual specificity protein kinase CLK3
Type:PROTEIN
Mol. Mass.:73855.32
Organism:Mus musculus
Description:ChEMBL_1502247
Residue:638
BDBM50259477
NameBDBM50259477
Synonyms:CHEMBL4071322
TypeSmall organic molecule
Emp. Form.C19H22N4O3
Mol. Mass.354.403
SMILESCCOC(=O)c1cccc(c1)-c1cnc2ccc(N[C@@H](CC)CO)nn12