Reaction Details
TargetDual specificity protein kinase CLK1
LigandBDBM50259416
Substrate/Competitorn/a
Meas. Tech.ChEBML_1691310
IC50 81±n/a nM
Citation Bendjeddou, LZLoaëc, NVilliers, BPrina, ESpäth, GFGalons, HMeijer, LOumata, N Exploration of the imidazo[1,2-b]pyridazine scaffold as a protein kinase inhibitor. Eur J Med Chem125:696-709 (2017) 
 
Dual specificity protein kinase CLK1
Name:Dual specificity protein kinase CLK1
Type:PROTEIN
Mol. Mass.:57124.52
Organism:Mus musculus
Description:ChEMBL_1502245
Residue:483
BDBM50259416
NameBDBM50259416
Synonyms:CHEMBL4089652
TypeSmall organic molecule
Emp. Form.C17H20N4OS
Mol. Mass.328.432
SMILESCC[C@@H](CO)Nc1ccc2ncc(-c3cccc(SC)c3)n2n1