Reaction Details
TargetDual specificity protein kinase CLK1
LigandBDBM50259559
Substrate/Competitorn/a
Meas. Tech.ChEBML_1691310
IC50 84±n/a nM
Citation Bendjeddou, LZLoaëc, NVilliers, BPrina, ESpäth, GFGalons, HMeijer, LOumata, N Exploration of the imidazo[1,2-b]pyridazine scaffold as a protein kinase inhibitor. Eur J Med Chem125:696-709 (2017) 
 
Dual specificity protein kinase CLK1
Name:Dual specificity protein kinase CLK1
Type:PROTEIN
Mol. Mass.:57124.52
Organism:Mus musculus
Description:ChEMBL_1502245
Residue:483
BDBM50259559
NameBDBM50259559
Synonyms:CHEMBL4071013
TypeSmall organic molecule
Emp. Form.C18H20ClN5O
Mol. Mass.357.837
SMILESOCCN1CCN(CC1)c1ccc2ncc(-c3cccc(Cl)c3)n2n1