Reaction Details
TargetAmine oxidase [flavin-containing] B
LigandBDBM23415
Substrate/Competitorn/a
Meas. Tech.ChEMBL_1691462 (CHEMBL4042111)
IC50 49±n/a nM
Citation Chaurasiya, NDGogineni, VElokely, KMLeón, FNúñez, MJKlein, MLWalker, LACutler, SJTekwani, BL Isolation of Acacetin from Calea urticifolia with Inhibitory Properties against Human Monoamine Oxidase-A and -B. J Nat Prod79:2538-2544 (2016) 
 
Amine oxidase [flavin-containing] B
Name:Amine oxidase [flavin-containing] B
Type:Protein
Mol. Mass.:58768.76
Organism:Homo sapiens (Human)
Description:P27338
Residue:520
BDBM23415
NameBDBM23415
Synonyms:5,7-dihydroxy-2-(4-methoxyphenyl)-4H-chromen-4-one CHEMBL243664
Typeflavone
Emp. Form.C16H12O5
Mol. Mass.284.2635
SMILESCOc1ccc(cc1)-c1cc(=O)c2c(O)cc(O)cc2o1