Reaction Details
Target5-hydroxytryptamine receptor 3A
LigandBDBM50259913
Substrate/Competitorn/a
Meas. Tech.ChEBML_1691999
IC50 13000±n/a nM
Citation Hill, MDFang, HDigavalli, SVHealy, FLGallagher, LPost-Munson, DChen, PNatale, JBenitex, YMorgan, DLodge, NBristow, LMacor, JEOlson, RE Development of spiroguanidine-derived?7 neuronal nicotinic receptor partial agonists. Bioorg Med Chem Lett27:578-581 (2017) 
 
5-hydroxytryptamine receptor 3A
Name:5-hydroxytryptamine receptor 3A
Type:Protein
Mol. Mass.:55283.27
Organism:Homo sapiens (Human)
Description:P46098
Residue:478
BDBM50259913
NameBDBM50259913
Synonyms:CHEMBL4082605
TypeSmall organic molecule
Emp. Form.C16H19ClN6S
Mol. Mass.362.88
SMILESCN1C(Nc2nc3ccc(Cl)nc3s2)=NCC11CN2CCC1CC2