Reaction Details
Target5-hydroxytryptamine receptor 3A
LigandBDBM50259924
Substrate/Competitorn/a
Meas. Tech.ChEBML_1691999
IC50 14500±n/a nM
Citation Hill, MDFang, HDigavalli, SVHealy, FLGallagher, LPost-Munson, DChen, PNatale, JBenitex, YMorgan, DLodge, NBristow, LMacor, JEOlson, RE Development of spiroguanidine-derived?7 neuronal nicotinic receptor partial agonists. Bioorg Med Chem Lett27:578-581 (2017) 
 
5-hydroxytryptamine receptor 3A
Name:5-hydroxytryptamine receptor 3A
Type:Protein
Mol. Mass.:55283.27
Organism:Homo sapiens (Human)
Description:P46098
Residue:478
BDBM50259924
NameBDBM50259924
Synonyms:CHEMBL4096397
TypeSmall organic molecule
Emp. Form.C17H20N6
Mol. Mass.308.3809
SMILESC1N=C(Nc2ncnc3ccccc23)NC11CN2CCC1CC2