Reaction Details
Target5-hydroxytryptamine receptor 3A
LigandBDBM50259936
Substrate/Competitorn/a
Meas. Tech.ChEBML_1691999
IC50 620±n/a nM
Citation Hill, MDFang, HDigavalli, SVHealy, FLGallagher, LPost-Munson, DChen, PNatale, JBenitex, YMorgan, DLodge, NBristow, LMacor, JEOlson, RE Development of spiroguanidine-derived?7 neuronal nicotinic receptor partial agonists. Bioorg Med Chem Lett27:578-581 (2017) 
 
5-hydroxytryptamine receptor 3A
Name:5-hydroxytryptamine receptor 3A
Type:Protein
Mol. Mass.:55283.27
Organism:Homo sapiens (Human)
Description:P46098
Residue:478
BDBM50259936
NameBDBM50259936
Synonyms:CHEMBL4077622
TypeSmall organic molecule
Emp. Form.C13H17ClN6
Mol. Mass.292.767
SMILESClc1cnc(NC2=NCC3(CN4CCC3CC4)N2)nc1