Reaction Details
TargetNeuronal acetylcholine receptor subunit alpha-7
LigandBDBM50259913
Substrate/Competitorn/a
Meas. Tech.ChEBML_1691998
EC50 550±n/a nM
Citation Hill, MDFang, HDigavalli, SVHealy, FLGallagher, LPost-Munson, DChen, PNatale, JBenitex, YMorgan, DLodge, NBristow, LMacor, JEOlson, RE Development of spiroguanidine-derived?7 neuronal nicotinic receptor partial agonists. Bioorg Med Chem Lett27:578-581 (2017) 
 
Neuronal acetylcholine receptor subunit alpha-7
Name:Neuronal acetylcholine receptor subunit alpha-7
Type:n/a
Mol. Mass.:56448.33
Organism:Homo sapiens (Human)
Description: CHRNA7 (NACHRA7)
Residue:502
BDBM50259913
NameBDBM50259913
Synonyms:CHEMBL4082605
TypeSmall organic molecule
Emp. Form.C16H19ClN6S
Mol. Mass.362.88
SMILESCN1C(Nc2nc3ccc(Cl)nc3s2)=NCC11CN2CCC1CC2