Reaction Details
TargetNeuronal acetylcholine receptor subunit alpha-7
LigandBDBM50259925
Substrate/Competitorn/a
Meas. Tech.ChEBML_1691998
EC50 140±n/a nM
Citation Hill, MDFang, HDigavalli, SVHealy, FLGallagher, LPost-Munson, DChen, PNatale, JBenitex, YMorgan, DLodge, NBristow, LMacor, JEOlson, RE Development of spiroguanidine-derived?7 neuronal nicotinic receptor partial agonists. Bioorg Med Chem Lett27:578-581 (2017) 
 
Neuronal acetylcholine receptor subunit alpha-7
Name:Neuronal acetylcholine receptor subunit alpha-7
Type:n/a
Mol. Mass.:56448.33
Organism:Homo sapiens (Human)
Description: CHRNA7 (NACHRA7)
Residue:502
BDBM50259925
NameBDBM50259925
Synonyms:CHEMBL4077127
TypeSmall organic molecule
Emp. Form.C16H20N8
Mol. Mass.324.3836
SMILESC1N=C(Nc2cc(ncn2)-n2ccnc2)NC11CN2CCC1CC2