Reaction Details
TargetNeuronal acetylcholine receptor subunit alpha-7
LigandBDBM50259945
Substrate/Competitorn/a
Meas. Tech.ChEBML_1691998
EC50 990±n/a nM
Citation Hill, MDFang, HDigavalli, SVHealy, FLGallagher, LPost-Munson, DChen, PNatale, JBenitex, YMorgan, DLodge, NBristow, LMacor, JEOlson, RE Development of spiroguanidine-derived?7 neuronal nicotinic receptor partial agonists. Bioorg Med Chem Lett27:578-581 (2017) 
 
Neuronal acetylcholine receptor subunit alpha-7
Name:Neuronal acetylcholine receptor subunit alpha-7
Type:n/a
Mol. Mass.:56448.33
Organism:Homo sapiens (Human)
Description: CHRNA7 (NACHRA7)
Residue:502
BDBM50259945
NameBDBM50259945
Synonyms:CHEMBL4093984
TypeSmall organic molecule
Emp. Form.C13H17ClN6
Mol. Mass.292.767
SMILESClc1cnc(NC2=NCC3(CN4CCC3CC4)N2)cn1