Reaction Details
Target5-hydroxytryptamine receptor 3A
LigandBDBM50259938
Substrate/Competitorn/a
Meas. Tech.ChEBML_1691999
IC50 26±n/a nM
Citation Hill, MDFang, HDigavalli, SVHealy, FLGallagher, LPost-Munson, DChen, PNatale, JBenitex, YMorgan, DLodge, NBristow, LMacor, JEOlson, RE Development of spiroguanidine-derived?7 neuronal nicotinic receptor partial agonists. Bioorg Med Chem Lett27:578-581 (2017) 
 
5-hydroxytryptamine receptor 3A
Name:5-hydroxytryptamine receptor 3A
Type:Protein
Mol. Mass.:55283.27
Organism:Homo sapiens (Human)
Description:P46098
Residue:478
BDBM50259938
NameBDBM50259938
Synonyms:CHEMBL4104136
TypeSmall organic molecule
Emp. Form.C16H19N5O
Mol. Mass.297.355
SMILESC1N=C(Nc2nc3ccccc3o2)NC11CN2CCC1CC2