Reaction Details
TargetMu-type opioid receptor
LigandBDBM50009678
Substrate/Competitorn/a
Meas. Tech.ChEBML_146268
Ki 14400±n/a nM
Citation Jacobson, ARTam, SWSayre, LM Modification of the enkephalin"message" with an artificial polycationic C-terminus. J Med Chem34:2816-21 (1991) Mu-type opioid receptor
Name:Mu-type opioid receptor
Type:Enzyme Catalytic Domain
Mol. Mass.:11165.58
Organism:GUINEA PIG
Description:P97266
Residue:98
BDBM50009678
NameBDBM50009678
Synonyms:4-Amino-N-[2-(4-amino-butyrylamino)-ethyl]-N-{2-[2-(2-{2-[2-amino-3-(4-hydroxy-phenyl)-propionylamino]-acetylamino}-acetylamino)-3-phenyl-propionylamino]-ethyl}-butyramide | CHEMBL98014
TypeSmall organic molecule
Emp. Form.C34H51N9O7
Mol. Mass.697.8248
SMILESNCCCC(=O)NCCN(CCNC(=O)[C@H](Cc1ccccc1)NC(=O)CNC(=O)CNC(=O)[C@@H](N)Cc1ccc(O)cc1)C(=O)CCCN