Reaction Details
TargetDelta-type opioid receptor
LigandBDBM50009676
Substrate/Competitorn/a
Meas. Tech.ChEBML_147292
Ki 10100±n/a nM
Citation Jacobson, ARTam, SWSayre, LM Modification of the enkephalin"message" with an artificial polycationic C-terminus. J Med Chem34:2816-21 (1991) Delta-type opioid receptor
Name:Delta-type opioid receptor
Type:G Protein-Coupled Receptor (GPCR)
Mol. Mass.:40382.98
Organism:Homo sapiens (Human)
Description:Competition binding assays were carried out using membrane preparations from transfected HN9.10 cells that constitutively expressed the delta opioid receptor.
Residue:372
BDBM50009676
NameBDBM50009676
Synonyms:4-Amino-N-{2-[2-(2-{2-[2-amino-3-(4-hydroxy-phenyl)-propionylamino]-acetylamino}-acetylamino)-3-phenyl-propionylamino]-ethyl}-butyramide | CHEMBL412591
TypeSmall organic molecule
Emp. Form.C28H39N7O6
Mol. Mass.569.6526
SMILESNCCCC(=O)NCCNC(=O)[C@H](Cc1ccccc1)NC(=O)CNC(=O)CNC(=O)[C@@H](N)Cc1ccc(O)cc1