Reaction Details
TargetKappa-type opioid receptor
LigandBDBM50009677
Substrate/Competitorn/a
Meas. Tech.ChEBML_145349
Ki 5510±n/a nM
Citation Jacobson, ARTam, SWSayre, LM Modification of the enkephalin"message" with an artificial polycationic C-terminus. J Med Chem34:2816-21 (1991) Kappa-type opioid receptor
Name:Kappa-type opioid receptor
Type:G Protein-Coupled Receptor (GPCR)
Mol. Mass.:42744.99
Organism:Cavia porcellus (domestic guinea pig)
Description:P41144
Residue:380
BDBM50009677
NameBDBM50009677
Synonyms:4-Amino-N-[3-(4-amino-butyrylamino)-propyl]-N-{3-[2-(2-{2-[2-amino-3-(4-hydroxy-phenyl)-propionylamino]-acetylamino}-acetylamino)-3-phenyl-propionylamino]-propyl}-butyramide | CHEMBL94792
TypeSmall organic molecule
Emp. Form.C36H55N9O7
Mol. Mass.725.878
SMILESNCCCC(=O)NCCCN(CCCNC(=O)[C@H](Cc1ccccc1)NC(=O)CNC(=O)CNC(=O)[C@@H](N)Cc1ccc(O)cc1)C(=O)CCCN