Reaction Details
TargetKappa-type opioid receptor
LigandBDBM50009678
Substrate/Competitorn/a
Meas. Tech.ChEBML_145349
Ki 8750±n/a nM
Citation Jacobson, ARTam, SWSayre, LM Modification of the enkephalin"message" with an artificial polycationic C-terminus. J Med Chem34:2816-21 (1991) Kappa-type opioid receptor
Name:Kappa-type opioid receptor
Type:G Protein-Coupled Receptor (GPCR)
Mol. Mass.:42744.99
Organism:Cavia porcellus (domestic guinea pig)
Description:P41144
Residue:380
BDBM50009678
NameBDBM50009678
Synonyms:4-Amino-N-[2-(4-amino-butyrylamino)-ethyl]-N-{2-[2-(2-{2-[2-amino-3-(4-hydroxy-phenyl)-propionylamino]-acetylamino}-acetylamino)-3-phenyl-propionylamino]-ethyl}-butyramide | CHEMBL98014
TypeSmall organic molecule
Emp. Form.C34H51N9O7
Mol. Mass.697.8248
SMILESNCCCC(=O)NCCN(CCNC(=O)[C@H](Cc1ccccc1)NC(=O)CNC(=O)CNC(=O)[C@@H](N)Cc1ccc(O)cc1)C(=O)CCCN