Reaction Details
TargetDelta-type opioid receptor
LigandBDBM50009677
Substrate/Competitorn/a
Meas. Tech.ChEBML_147292
Ki 8430±n/a nM
Citation Jacobson, ARTam, SWSayre, LM Modification of the enkephalin"message" with an artificial polycationic C-terminus. J Med Chem34:2816-21 (1991) Delta-type opioid receptor
Name:Delta-type opioid receptor
Type:G Protein-Coupled Receptor (GPCR)
Mol. Mass.:40382.98
Organism:Homo sapiens (Human)
Description:Competition binding assays were carried out using membrane preparations from transfected HN9.10 cells that constitutively expressed the delta opioid receptor.
Residue:372
BDBM50009677
NameBDBM50009677
Synonyms:4-Amino-N-[3-(4-amino-butyrylamino)-propyl]-N-{3-[2-(2-{2-[2-amino-3-(4-hydroxy-phenyl)-propionylamino]-acetylamino}-acetylamino)-3-phenyl-propionylamino]-propyl}-butyramide | CHEMBL94792
TypeSmall organic molecule
Emp. Form.C36H55N9O7
Mol. Mass.725.878
SMILESNCCCC(=O)NCCCN(CCCNC(=O)[C@H](Cc1ccccc1)NC(=O)CNC(=O)CNC(=O)[C@@H](N)Cc1ccc(O)cc1)C(=O)CCCN