Reaction Details
TargetDelta-type opioid receptor
LigandBDBM50009674
Substrate/Competitorn/a
Meas. Tech.ChEBML_147292
Ki>10000±n/a nM
Citation Jacobson, ARTam, SWSayre, LM Modification of the enkephalin"message" with an artificial polycationic C-terminus. J Med Chem34:2816-21 (1991) Delta-type opioid receptor
Name:Delta-type opioid receptor
Type:G Protein-Coupled Receptor (GPCR)
Mol. Mass.:40382.98
Organism:Homo sapiens (Human)
Description:Competition binding assays were carried out using membrane preparations from transfected HN9.10 cells that constitutively expressed the delta opioid receptor.
Residue:372
BDBM50009674
NameBDBM50009674
Synonyms:4-Amino-N-[2-(4-amino-butyrylamino)-ethyl]-N-[2-((4-amino-butyryl)-{2-[2-(2-{2-[2-amino-3-(4-hydroxy-phenyl)-propionylamino]-acetylamino}-acetylamino)-3-phenyl-propionylamino]-ethyl}-amino)-ethyl]-butyramide | CHEMBL97363
TypeSmall organic molecule
Emp. Form.C40H63N11O8
Mol. Mass.825.9971
SMILESNCCCC(=O)NCCN(CCN(CCNC(=O)[C@H](Cc1ccccc1)NC(=O)CNC(=O)CNC(=O)[C@@H](N)Cc1ccc(O)cc1)C(=O)CCCN)C(=O)CCCN