Reaction Details
TargetPolyunsaturated fatty acid 5-lipoxygenase
LigandBDBM50009942
Substrate/Competitorn/a
Meas. Tech.ChEBML_734
IC50 670.0±n/a nM
Citation Hlasta, DJCasey, FBFerguson, EWGangell, SJHeimann, MRJaeger, EPKullnig, RKGordon, RJ 5-Lipoxygenase inhibitors: the synthesis and structure-activity relationships of a series of 1-phenyl-3-pyrazolidinones. J Med Chem34:1560-70 (1991) Polyunsaturated fatty acid 5-lipoxygenase
Name:Polyunsaturated fatty acid 5-lipoxygenase
Type:PROTEIN
Mol. Mass.:78082.31
Organism:Rattus norvegicus
Description:ChEMBL_1432947
Residue:673
BDBM50009942
NameBDBM50009942
Synonyms:4-Methoxymethyl-4-methyl-1-phenyl-pyrazolidin-3-one | CHEMBL40105
TypeSmall organic molecule
Emp. Form.C12H16N2O2
Mol. Mass.220.2676
SMILESCOCC1(C)CN(NC1=O)c1ccccc1