Reaction Details
TargetPolyunsaturated fatty acid 5-lipoxygenase
LigandBDBM50009943
Substrate/Competitorn/a
Meas. Tech.ChEBML_734
IC50 260±n/a nM
Citation Hlasta, DJCasey, FBFerguson, EWGangell, SJHeimann, MRJaeger, EPKullnig, RKGordon, RJ 5-Lipoxygenase inhibitors: the synthesis and structure-activity relationships of a series of 1-phenyl-3-pyrazolidinones. J Med Chem34:1560-70 (1991) Polyunsaturated fatty acid 5-lipoxygenase
Name:Polyunsaturated fatty acid 5-lipoxygenase
Type:PROTEIN
Mol. Mass.:78082.31
Organism:Rattus norvegicus
Description:ChEMBL_1432947
Residue:673
BDBM50009943
NameBDBM50009943
Synonyms:1-Phenyl-4-propoxymethyl-pyrazolidin-3-one | CHEMBL38795
TypeSmall organic molecule
Emp. Form.C13H18N2O2
Mol. Mass.234.2942
SMILESCCCOCC1CN(NC1=O)c1ccccc1