Reaction Details
TargetPolyunsaturated fatty acid 5-lipoxygenase
LigandBDBM50009949
Substrate/Competitorn/a
Meas. Tech.ChEBML_734
IC50 220±n/a nM
Citation Hlasta, DJCasey, FBFerguson, EWGangell, SJHeimann, MRJaeger, EPKullnig, RKGordon, RJ 5-Lipoxygenase inhibitors: the synthesis and structure-activity relationships of a series of 1-phenyl-3-pyrazolidinones. J Med Chem34:1560-70 (1991) Polyunsaturated fatty acid 5-lipoxygenase
Name:Polyunsaturated fatty acid 5-lipoxygenase
Type:PROTEIN
Mol. Mass.:78082.31
Organism:Rattus norvegicus
Description:ChEMBL_1432947
Residue:673
BDBM50009949
NameBDBM50009949
Synonyms:4-(2-Methoxy-ethyl)-1-(3-trifluoromethyl-phenyl)-pyrazolidin-3-one | CHEMBL41582
TypeSmall organic molecule
Emp. Form.C13H15F3N2O2
Mol. Mass.288.2656
SMILESCOCCC1CN(NC1=O)c1cccc(c1)C(F)(F)F