Reaction Details
TargetPolyunsaturated fatty acid 5-lipoxygenase
LigandBDBM50009954
Substrate/Competitorn/a
Meas. Tech.ChEBML_734
IC50 120±n/a nM
Citation Hlasta, DJCasey, FBFerguson, EWGangell, SJHeimann, MRJaeger, EPKullnig, RKGordon, RJ 5-Lipoxygenase inhibitors: the synthesis and structure-activity relationships of a series of 1-phenyl-3-pyrazolidinones. J Med Chem34:1560-70 (1991) Polyunsaturated fatty acid 5-lipoxygenase
Name:Polyunsaturated fatty acid 5-lipoxygenase
Type:PROTEIN
Mol. Mass.:78082.31
Organism:Rattus norvegicus
Description:ChEMBL_1432947
Residue:673
BDBM50009954
NameBDBM50009954
Synonyms:1-Phenyl-4-(pyridin-2-ylsulfanyl)-pyrazolidin-3-one | CHEMBL37122
TypeSmall organic molecule
Emp. Form.C14H13N3OS
Mol. Mass.271.338
SMILESO=C1NN(CC1Sc1ccccn1)c1ccccc1