Reaction Details
TargetPolyunsaturated fatty acid 5-lipoxygenase
LigandBDBM50009959
Substrate/Competitorn/a
Meas. Tech.ChEBML_734
IC50>1000±n/a nM
Citation Hlasta, DJCasey, FBFerguson, EWGangell, SJHeimann, MRJaeger, EPKullnig, RKGordon, RJ 5-Lipoxygenase inhibitors: the synthesis and structure-activity relationships of a series of 1-phenyl-3-pyrazolidinones. J Med Chem34:1560-70 (1991) Polyunsaturated fatty acid 5-lipoxygenase
Name:Polyunsaturated fatty acid 5-lipoxygenase
Type:PROTEIN
Mol. Mass.:78082.31
Organism:Rattus norvegicus
Description:ChEMBL_1432947
Residue:673
BDBM50009959
NameBDBM50009959
Synonyms:4-(2-Methoxy-ethyl)-1-phenyl-1H-pyrazol-3-ol | CHEMBL41293
TypeSmall organic molecule
Emp. Form.C12H14N2O2
Mol. Mass.218.2518
SMILESCOCCc1cn([nH]c1=O)-c1ccccc1