Reaction Details
TargetProstaglandin G/H synthase 2
LigandBDBM50260462
Substrate/Competitorn/a
Meas. Tech.ChEBML_1693913
IC50 1500±n/a nM
Citation Zhou, SYang, SHuang, G Design, synthesis and bioactivities of Celecoxib analogues or derivatives. Bioorg Med Chem25:4887-4893 (2017) 
 
Prostaglandin G/H synthase 2
Name:Prostaglandin G/H synthase 2
Type:Enzyme Catalytic Domain
Mol. Mass.:69173.51
Organism:RAT
Description:COX-2 0 RAT::P35355
Residue:604
BDBM50260462
NameBDBM50260462
Synonyms:CHEMBL4071496
TypeSmall organic molecule
Emp. Form.C16H19N3O2S2
Mol. Mass.349.471
SMILESCN1C=CC(C=C1)C1SC(C)=CN1c1ccc(cc1)S(N)(=O)=O