Reaction Details
TargetProstaglandin G/H synthase 2
LigandBDBM50260464
Substrate/Competitorn/a
Meas. Tech.ChEBML_1693913
IC50 49±n/a nM
Citation Zhou, SYang, SHuang, G Design, synthesis and bioactivities of Celecoxib analogues or derivatives. Bioorg Med Chem25:4887-4893 (2017) 
 
Prostaglandin G/H synthase 2
Name:Prostaglandin G/H synthase 2
Type:Enzyme Catalytic Domain
Mol. Mass.:69173.51
Organism:RAT
Description:COX-2 0 RAT::P35355
Residue:604
BDBM50260464
NameBDBM50260464
Synonyms:CHEMBL4071383
TypeSmall organic molecule
Emp. Form.C15H16F3N5O2S
Mol. Mass.387.38
SMILESCN1C=CN(C=C1)C1NC(=CN1c1ccc(cc1)S(N)(=O)=O)C(F)(F)F