Reaction Details
TargetProstaglandin G/H synthase 2
LigandBDBM11639
Substrate/Competitorn/a
Meas. Tech.ChEBML_1693913
IC50 71±n/a nM
Citation Zhou, SYang, SHuang, G Design, synthesis and bioactivities of Celecoxib analogues or derivatives. Bioorg Med Chem25:4887-4893 (2017) 
 
Prostaglandin G/H synthase 2
Name:Prostaglandin G/H synthase 2
Type:Enzyme Catalytic Domain
Mol. Mass.:69173.51
Organism:RAT
Description:COX-2 0 RAT::P35355
Residue:604
BDBM11639
NameBDBM11639
Synonyms:4-[5-(4-methylphenyl)-3-(trifluoromethyl)-1H-pyrazol-1-yl]benzene-1-sulfonamide CLX Celecoxib US11478464, Compound Celecoxib US8741944, Comparative Compound cid_2662
TypeSmall organic molecule
Emp. Form.C17H14F3N3O2S
Mol. Mass.381.372
SMILESCc1ccc(cc1)-c1cc(nn1-c1ccc(cc1)S(N)(=O)=O)C(F)(F)F