Reaction Details
TargetSerine/threonine-protein kinase pim-1
LigandBDBM50364777
Substrate/Competitorn/a
Meas. Tech.ChEBML_1694026
IC50 1.000000±n/a nM
Citation Swellmeen, LShahin, RAl-Hiari, YAlamiri, AHasan, AShaheen, O Structure based drug design of Pim-1 kinase followed by pharmacophore guided synthesis of quinolone-based inhibitors. Bioorg Med Chem25:4855-4875 (2017) 
 
Serine/threonine-protein kinase pim-1
Name:Serine/threonine-protein kinase pim-1
Type:Protein
Mol. Mass.:35681.82
Organism:Homo sapiens (Human)
Description:P11309
Residue:313
BDBM50364777
NameBDBM50364777
Synonyms:CHEMBL1952142
TypeSmall organic molecule
Emp. Form.C19H21F3N6O2
Mol. Mass.422.4042
SMILESCOc1cc(NCC2CCNCC2)nc2n(nnc12)-c1cccc(OC(F)(F)F)c1